Reaction Details
TargetD(4) dopamine receptor
LigandBDBM50050475
Substrate/Competitorn/a
Meas. Tech.ChEMBL_60829 (CHEMBL675818)
Ki 3.6±n/a nM
Citation Rowley, MCollins, IBroughton, HBDavey, WBBaker, REmms, FMarwood, RPatel, SPatel, SRagan, CIFreedman, SBBall, RLeeson, PD 4-Heterocyclylpiperidines as selective high-affinity ligands at the human dopamine D4 receptor. J Med Chem40:2374-85 (1997) 
 
D(4) dopamine receptor
Name:D(4) dopamine receptor
Type:Enzyme
Mol. Mass.:48373.19
Organism:Homo sapiens (Human)
Description:P21917
Residue:419
BDBM50050475
NameBDBM50050475
Synonyms:1-(4-Chloro-benzyl)-4-[3-(4-chloro-phenyl)-isoxazol-5-yl]-piperidine | CHEMBL61195
TypeSmall organic molecule
Emp. Form.C21H20Cl2N2O
Mol. Mass.387.302
SMILESClc1ccc(CN2CCC(CC2)c2cc(no2)-c2ccc(Cl)cc2)cc1