Reaction Details
TargetTau-tubulin kinase 2
LigandBDBM50044784
Substrate/Competitorn/a
Meas. Tech.ChEMBL_1828769 (CHEMBL4328643)
IC50 9340±n/a nM
Citation Narayan, SRamisetti, SJaiswal, ASLaw, BKSingh-Pillay, ASingh, PAmin, SSharma, AK ASR352, A potent anticancer agent: Synthesis, preliminary SAR, and biological activities against colorectal cancer bulk, 5-fluorouracil/oxaliplatin resistant and stem cells. Eur J Med Chem161:456-467 (2019) 
 
Tau-tubulin kinase 2
Name:Tau-tubulin kinase 2
Type:PROTEIN
Mol. Mass.:137421.41
Organism:Homo sapiens (Human)
Description:ChEMBL_109480
Residue:1244
BDBM50044784
NameBDBM50044784
Synonyms:CHEBI:79090 US10865384, Compound SB202190
TypeSmall organic molecule
Emp. Form.C20H14FN3O
Mol. Mass.331.3431
SMILESOc1ccc(cc1)-c1nc(c([nH]1)-c1ccncc1)-c1ccc(F)cc1