Reaction Details
TargetMitogen-activated protein kinase kinase kinase 20
LigandBDBM50085415
Substrate/Competitorn/a
Meas. Tech.ChEMBL_1828784 (CHEMBL4328658)
IC50 1890±n/a nM
Citation Narayan, SRamisetti, SJaiswal, ASLaw, BKSingh-Pillay, ASingh, PAmin, SSharma, AK ASR352, A potent anticancer agent: Synthesis, preliminary SAR, and biological activities against colorectal cancer bulk, 5-fluorouracil/oxaliplatin resistant and stem cells. Eur J Med Chem161:456-467 (2019) 
 
Mitogen-activated protein kinase kinase kinase 20
Name:Mitogen-activated protein kinase kinase kinase 20
Type:PROTEIN
Mol. Mass.:91168.58
Organism:Homo sapiens (Human)
Description:ChEMBL_1495629
Residue:800
BDBM50085415
NameBDBM50085415
Synonyms:3-(3,5-Dibromo-4-hydroxy-benzylidene)-5-iodo-1,3-dihydro-indol-2-one 3-[1-(3,5-Dibromo-4-hydroxy-phenyl)-meth-(Z)-ylidene]-5-iodo-1,3-dihydro-indol-2-one G6416 (GW5074) | GW-5074
TypeSmall organic molecule
Emp. Form.C15H8Br2INO2
Mol. Mass.520.942
SMILESOc1c(Br)cc(\C=C2/C(=O)Nc3ccc(I)cc23)cc1Br