Reaction Details
TargetFolate receptor alpha
LigandBDBM50059338
Substrate/Competitorn/a
Meas. Tech.ChEMBL_68374 (CHEMBL678783)
Kd 0.57±n/a nM
Citation Varney, MDPalmer, CLRomines, WHBoritzki, TMargosiak, SAAlmassy, RJanson, CABartlett, CHowland, EJFerre, R Protein structure-based design, synthesis, and biological evaluation of 5-thia-2,6-diamino-4(3H)-oxopyrimidines: potent inhibitors of glycinamide ribonucleotide transformylase with potent cell growth inhibition. J Med Chem40:2502-24 (1997) 
 
Folate receptor alpha
Name:Folate receptor alpha
Type:PROTEIN
Mol. Mass.:29827.41
Organism:Homo sapiens (Human)
Description:ChEMBL_1469596
Residue:257
BDBM50059338
NameBDBM50059338
Synonyms:(S)-2-{[6-(2,4-Diamino-6-oxo-1,6-dihydro-pyrimidin-5-ylsulfanylmethyl)-4,5,6,7-tetrahydro-benzo[b]thiophene-2-carbonyl]-amino}-pentanedioic acid | CHEMBL309415
TypeSmall organic molecule
Emp. Form.C19H23N5O6S2
Mol. Mass.481.546
SMILESNc1nc(N)c(SCC2CCc3cc(sc3C2)C(=O)N[C@@H](CCC(O)=O)C(O)=O)c(=O)[nH]1