Reaction Details
TargetMu-type opioid receptor
LigandBDBM50059367
Substrate/Competitorn/a
Meas. Tech.ChEMBL_75462 (CHEMBL686360)
IC50 4.5±n/a nM
Citation Bryant, SDGuerrini, RSalvadori, SBianchi, CTomatis, RAttila, MLazarus, LH Helix-inducing alpha-aminoisobutyric acid in opioid mimetic deltorphin C analogues. J Med Chem40:2579-87 (1997) 
 
Mu-type opioid receptor
Name:Mu-type opioid receptor
Type:Enzyme Catalytic Domain
Mol. Mass.:11165.58
Organism:GUINEA PIG
Description:P97266
Residue:98
BDBM50059367
NameBDBM50059367
Synonyms:(S)-2-[2-((S)-2-{(R)-2-[(S)-2-Amino-3-(4-hydroxy-phenyl)-propionylamino]-propionylamino}-3-phenyl-propionylamino)-2-methyl-propionylamino]-N-[(S)-1-(carbamoylmethyl-carbamoyl)-2-methyl-propyl]-3-methyl-butyramide | CHEMBL420606
TypeSmall organic molecule
Emp. Form.C37H54N8O8
Mol. Mass.738.8735
SMILESCC(C)[C@H](NC(=O)[C@@H](NC(=O)C(C)(C)NC(=O)[C@H](Cc1ccccc1)NC(=O)[C@@H](C)NC(=O)[C@@H](N)Cc1ccc(O)cc1)C(C)C)C(=O)NCC(N)=O