Reaction Details
TargetAdenosine receptor A3
LigandBDBM85776
Substrate/Competitorn/a
Meas. Tech.ChEMBL_32001 (CHEMBL646598)
Ki 31±n/a nM
Citation Jiang, Jvan Rhee, AMChang, LPatchornik, AJi, XDEvans, PMelman, NJacobson, KA Structure-activity relationships of 4-(phenylethynyl)-6-phenyl-1,4-dihydropyridines as highly selective A3 adenosine receptor antagonists. J Med Chem40:2596-608 (1997) 
 
Adenosine receptor A3
Name:Adenosine receptor A3
Type:G Protein-Coupled Receptor (GPCR)
Mol. Mass.:36197.32
Organism:Homo sapiens (Human)
Description:P0DMS8
Residue:318
BDBM85776
NameBDBM85776
Synonyms:CAS_393594 MRS1191 | NSC_393594
TypeSmall organic molecule
Emp. Form.C31H27NO4
Mol. Mass.477.5504
SMILESCCOC(=O)C1C(C#Cc2ccccc2)C(C(=O)OCc2ccccc2)=C(N=C1C)c1ccccc1