Reaction Details
TargetAlpha-1A adrenergic receptor
LigandBDBM50054387
Substrate/Competitorn/a
Meas. Tech.ChEMBL_33283 (CHEMBL644243)
Ki 9.9±n/a nM
Citation López-Rodríguez, MLMorcillo, MJFernández, EPorras, EMurcia, MSanz, AMOrensanz, L Synthesis and structure-activity relationships of a new model of arylpiperazines. 3.1 2-[omega-(4-arylpiperazin-1-yl)alkyl]perhydropyrrolo- [1,2-c]imidazoles and -perhydroimidazo[1,5-a]pyridines: study of the influence of the terminal amide fragment on 5-HT1A affinity/selectivity. J Med Chem40:2653-6 (1997) 
 
Alpha-1A adrenergic receptor
Name:Alpha-1A adrenergic receptor
Type:Protein
Mol. Mass.:51620.15
Organism:Rattus norvegicus (Rat)
Description:P43140
Residue:466
BDBM50054387
NameBDBM50054387
Synonyms:2-{3-[4-(2-Methoxy-phenyl)-piperazin-1-yl]-propyl}-tetrahydro-imidazo[1,5-a]pyridine-1,3-dione | CHEMBL43992
TypeSmall organic molecule
Emp. Form.C21H30N4O3
Mol. Mass.386.4879
SMILESCOc1ccccc1N1CCN(CCCn2c(O)c3CCCCn3c2=O)CC1