Reaction Details
TargetD(4) dopamine receptor
LigandBDBM50059495
Substrate/Competitorn/a
Meas. Tech.ChEMBL_63103 (CHEMBL674496)
Ki 7.5±n/a nM
Citation Unangst, PCCapiris, TConnor, DTHeffner, TGMacKenzie, RGMiller, SRPugsley, TAWise, LD Chromeno[3,4-c]pyridin-5-ones: selective human dopamine D4 receptor antagonists as potential antipsychotic agents. J Med Chem40:2688-93 (1997) 
 
D(4) dopamine receptor
Name:D(4) dopamine receptor
Type:Enzyme
Mol. Mass.:48373.19
Organism:Homo sapiens (Human)
Description:P21917
Residue:419
BDBM50059495
NameBDBM50059495
Synonyms:8-Methoxy-3-(4-nitro-benzyl)-1,2,3,4-tetrahydro-chromeno[3,4-c]pyridin-5-one | CHEMBL88296
TypeSmall organic molecule
Emp. Form.C20H18N2O5
Mol. Mass.366.3673
SMILESCOc1ccc2c3CCN(Cc4ccc(cc4)[N+]([O-])=O)Cc3c(=O)oc2c1