Reaction Details
TargetHistone deacetylase 6
LigandBDBM22449
Substrate/Competitorn/a
Meas. Tech.ChEMBL_1829508 (CHEMBL4329382)
IC50 4.0±n/a nM
Citation Fleming, CLNatoli, ASchreuders, JDevlin, MYoganantharajah, PGibert, YLeslie, KGNew, EJAshton, TDPfeffer, FM Highly fluorescent and HDAC6 selective scriptaid analogues. Eur J Med Chem162:321-333 (2019) 
 
Histone deacetylase 6
Name:Histone deacetylase 6
Type:Chromatin regulator; hydrolase; repressor
Mol. Mass.:131381.51
Organism:Homo sapiens (Human)
Description:Q9UBN7
Residue:1215
BDBM22449
NameBDBM22449
Synonyms:CHEMBL356769 Tubacin | US9249087, Tubastatin A
TypeSmall organic molecule
Emp. Form.C41H43N3O7S
Mol. Mass.721.861
SMILESOCc1ccc(cc1)[C@@H]1C[C@H](CSc2nc(c(o2)-c2ccccc2)-c2ccccc2)O[C@@H](O1)c1ccc(NC(=O)CCCCCCC(=O)NO)cc1