Reaction Details
Target5-lipoxygenase
LigandBDBM50059626
Substrate/Competitorn/a
Meas. Tech.ChEMBL_157767 (CHEMBL767670)
IC50 4000±n/a nM
Citation Müller, KPrinz, H Antipsoriatic anthrones with modulated redox properties. 4. Synthesis and biological activity of novel 9,10-dihydro-1,8-dihydroxy-9-oxo-2-anthracenecarboxylic and -hydroxamic acids. J Med Chem40:2780-7 (1997) 
 
5-lipoxygenase
Name:5-lipoxygenase
Synonyms:Arachidonate 5-lipoxygenase
Type:PROTEIN
Mol. Mass.:49994.23
Organism:Bos taurus
Description:ChEMBL_157766
Residue:430
BDBM50059626
NameBDBM50059626
TypeSmall organic molecule
Emp. Form.C23H17NO6
Mol. Mass.403.3842
SMILESCN(O)C(=O)c1ccc(cc1)C(=O)c1ccc2Cc3cccc(O)c3C(=O)c2c1O