Reaction Details
TargetDihydrofolate reductase
LigandBDBM50059948
Substrate/Competitorn/a
Meas. Tech.ChEMBL_55294 (CHEMBL665205)
Ki 0.0004±n/a nM
Citation Robson, CMeek, MAGrunwaldt, JDLambert, PAQueener, SFSchmidt, DGriffin, RJ Nonclassical 2,4-diamino-5-aryl-6-ethylpyrimidine antifolates: activity as inhibitors of dihydrofolate reductase from Pneumocystis carinii and Toxoplasma gondii and as antitumor agents. J Med Chem40:3040-8 (1997) 
 
Dihydrofolate reductase
Name:Dihydrofolate reductase
Type:Enzyme
Mol. Mass.:21638.84
Organism:Rattus norvegicus (rat)
Description:n/a
Residue:187
BDBM50059948
NameBDBM50059948
Synonyms:4-({[4-(2,4-Diamino-6-ethyl-pyrimidin-5-yl)-2-nitro-phenyl]-methyl-amino}-methyl)-benzoic acid | CHEMBL102850
TypeSmall organic molecule
Emp. Form.C21H22N6O4
Mol. Mass.422.4372
SMILESCCc1nc(N)nc(N)c1-c1ccc(N(C)Cc2ccc(cc2)C(O)=O)c(c1)[N+]([O-])=O