Reaction Details
TargetDihydrofolate reductase
LigandBDBM50059956
Substrate/Competitorn/a
Meas. Tech.ChEMBL_55294 (CHEMBL665205)
Ki 0.12±n/a nM
Citation Robson, CMeek, MAGrunwaldt, JDLambert, PAQueener, SFSchmidt, DGriffin, RJ Nonclassical 2,4-diamino-5-aryl-6-ethylpyrimidine antifolates: activity as inhibitors of dihydrofolate reductase from Pneumocystis carinii and Toxoplasma gondii and as antitumor agents. J Med Chem40:3040-8 (1997) 
 
Dihydrofolate reductase
Name:Dihydrofolate reductase
Type:Enzyme
Mol. Mass.:21638.84
Organism:Rattus norvegicus (rat)
Description:n/a
Residue:187
BDBM50059956
NameBDBM50059956
Synonyms:5-(3,4-DICHLOROPHENYL)-6-METHYLPYRIMIDINE-2,4-DIAMINE 5-(3,4-Dichloro-phenyl)-6-methyl-pyrimidine-2,4-diamine(Metoprine) DDMP5-(3,4-Dichloro-phenyl)-6-methyl-pyrimidine-2,4-diamine TCMDC-123931
TypeSmall organic molecule
Emp. Form.C11H10Cl2N4
Mol. Mass.269.13
SMILESCc1nc(N)nc(N)c1-c1ccc(Cl)c(Cl)c1