Reaction Details
TargetSodium-dependent serotonin transporter
LigandBDBM50060469
Substrate/Competitorn/a
Meas. Tech.ChEMBL_192825 (CHEMBL872975)
IC50 5100±n/a nM
Citation McKenna, MTProctor, GRYoung, LCHarvey, AL Novel tacrine analogues for potential use against Alzheimer's disease: potent and selective acetylcholinesterase inhibitors and 5-HT uptake inhibitors. J Med Chem40:3516-23 (1997) 
 
Sodium-dependent serotonin transporter
Name:Sodium-dependent serotonin transporter
Type:Multi-pass membrane protein
Mol. Mass.:70168.43
Organism:Rattus norvegicus (rat)
Description:P31652
Residue:630
BDBM50060469
NameBDBM50060469
Synonyms:2,3-Dimethyl-1H-cyclopenta[b]quinolin-9-ylamine CHEMBL119390
TypeSmall organic molecule
Emp. Form.C14H14N2
Mol. Mass.210.2744
SMILESCC1=C(C)c2nc3ccccc3c(N)c2C1