Reaction Details
TargetAcetylcholinesterase
LigandBDBM50060469
Substrate/Competitorn/a
Meas. Tech.ChEMBL_29098 (CHEMBL636836)
IC50 3500±n/a nM
Citation McKenna, MTProctor, GRYoung, LCHarvey, AL Novel tacrine analogues for potential use against Alzheimer's disease: potent and selective acetylcholinesterase inhibitors and 5-HT uptake inhibitors. J Med Chem40:3516-23 (1997) 
 
Acetylcholinesterase
Name:Acetylcholinesterase
Type:Enzyme
Mol. Mass.:68193.62
Organism:Rattus norvegicus (rat)
Description:P37136
Residue:614
BDBM50060469
NameBDBM50060469
Synonyms:2,3-Dimethyl-1H-cyclopenta[b]quinolin-9-ylamine CHEMBL119390
TypeSmall organic molecule
Emp. Form.C14H14N2
Mol. Mass.210.2744
SMILESCC1=C(C)c2nc3ccccc3c(N)c2C1