Reaction Details
TargetTransporter
LigandBDBM50060472
Substrate/Competitorn/a
Meas. Tech.ChEMBL_192826 (CHEMBL797692)
IC50 800±n/a nM
Citation McKenna, MTProctor, GRYoung, LCHarvey, AL Novel tacrine analogues for potential use against Alzheimer's disease: potent and selective acetylcholinesterase inhibitors and 5-HT uptake inhibitors. J Med Chem40:3516-23 (1997) 
 
Transporter
Name:Transporter
Type:PROTEIN
Mol. Mass.:66787.87
Organism:Rattus norvegicus
Description:ChEMBL_1463061
Residue:597
BDBM50060472
NameBDBM50060472
Synonyms:6,7,8,9,10,11-Hexahydro-cycloocta[b]quinolin-12-ylamine CHEMBL118968
TypeSmall organic molecule
Emp. Form.C15H18N2
Mol. Mass.226.3168
SMILESNc1c2CCCCCCc2nc2ccccc12