Reaction Details
TargetCholinesterase
LigandBDBM50060471
Substrate/Competitorn/a
Meas. Tech.ChEMBL_41408 (CHEMBL653528)
IC50 10300±n/a nM
Citation McKenna, MTProctor, GRYoung, LCHarvey, AL Novel tacrine analogues for potential use against Alzheimer's disease: potent and selective acetylcholinesterase inhibitors and 5-HT uptake inhibitors. J Med Chem40:3516-23 (1997) 
 
Cholinesterase
Name:Cholinesterase
Type:Homotetramer
Mol. Mass.:68422.27
Organism:Homo sapiens (Human)
Description:P06276
Residue:602
BDBM50060471
NameBDBM50060471
Synonyms:4-Chloro-5,6-dihydro-benzo[c]acridin-7-ylamine | CHEMBL333011
TypeSmall organic molecule
Emp. Form.C17H13ClN2
Mol. Mass.280.752
SMILESNc1c2CCc3c(Cl)cccc3-c2nc2ccccc12