Reaction Details
TargetSodium-dependent serotonin transporter
LigandBDBM50060476
Substrate/Competitorn/a
Meas. Tech.ChEMBL_192825 (CHEMBL872975)
IC50 6900±n/a nM
Citation McKenna, MTProctor, GRYoung, LCHarvey, AL Novel tacrine analogues for potential use against Alzheimer's disease: potent and selective acetylcholinesterase inhibitors and 5-HT uptake inhibitors. J Med Chem40:3516-23 (1997) 
 
Sodium-dependent serotonin transporter
Name:Sodium-dependent serotonin transporter
Type:Multi-pass membrane protein
Mol. Mass.:70168.43
Organism:Rattus norvegicus (rat)
Description:P31652
Residue:630
BDBM50060476
NameBDBM50060476
Synonyms:5,6,7,8-tetrahydrobenzo[2,3]azocino[4,5-b]quinolin-9-amine CHEMBL325203
TypeSmall organic molecule
Emp. Form.C18H17N3
Mol. Mass.275.3477
SMILESNc1c2CCCNc3ccccc3-c2nc2ccccc12