Reaction Details
TargetTransporter
LigandBDBM50060481
Substrate/Competitorn/a
Meas. Tech.ChEMBL_192826 (CHEMBL797692)
IC50 12100±n/a nM
Citation McKenna, MTProctor, GRYoung, LCHarvey, AL Novel tacrine analogues for potential use against Alzheimer's disease: potent and selective acetylcholinesterase inhibitors and 5-HT uptake inhibitors. J Med Chem40:3516-23 (1997) 
 
Transporter
Name:Transporter
Type:PROTEIN
Mol. Mass.:66787.87
Organism:Rattus norvegicus
Description:ChEMBL_1463061
Residue:597
BDBM50060481
NameBDBM50060481
Synonyms:5,6-Dihydro-benzo[c]acridin-7-ylamine CHEMBL89012
TypeSmall organic molecule
Emp. Form.C17H14N2
Mol. Mass.246.3065
SMILESNc1c2CCc3ccccc3-c2nc2ccccc12