Reaction Details
TargetDihydroorotate dehydrogenase (quinone), mitochondrial
LigandBDBM24400
Substrate/Competitorn/a
Meas. Tech.ChEMBL_1831514 (CHEMBL4331522)
IC50 65±n/a nM
Citation Pippione, ACSainas, SGoyal, PFritzson, ICassiano, GCGiraudo, AGiorgis, MTavella, TABagnati, RRolando, BCaing-Carlsson, RCosta, FTMAndrade, CHAl-Karadaghi, SBoschi, DFriemann, RLolli, ML Hydroxyazole scaffold-based Plasmodium falciparum dihydroorotate dehydrogenase inhibitors: Synthesis, biological evaluation and X-ray structural studies. Eur J Med Chem163:266-280 (2019) 
 
Dihydroorotate dehydrogenase (quinone), mitochondrial
Name:Dihydroorotate dehydrogenase (quinone), mitochondrial
Type:Enzyme
Mol. Mass.:65581.88
Organism:Plasmodium falciparum (isolate 3D7)
Description:Q08210
Residue:569
BDBM24400
NameBDBM24400
Synonyms:5-methyl-N-(naphthalen-2-yl)-[1,2,4]triazolo[1,5-a]pyrimidin-7-amine Triazolopyrimidine-Based Compound, 7
TypeSmall organic molecule
Emp. Form.C16H13N5
Mol. Mass.275.3079
SMILESCc1cc(Nc2ccc3ccccc3c2)n2ncnc2n1