Reaction Details
TargetNeuropeptide Y receptor type 1
LigandBDBM50060721
Substrate/Competitorn/a
Meas. Tech.ChEMBL_143827 (CHEMBL748712)
Ki 4.6±n/a nM
Citation Hipskind, PALobb, KLNixon, JABritton, TCBruns, RFCatlow, JDieckman-McGinty, DKGackenheimer, SLGitter, BDIyengar, SSchober, DASimmons, RMSwanson, SZarrinmayeh, HZimmerman, DMGehlert, DR Potent and selective 1,2,3-trisubstituted indole NPY Y-1 antagonists. J Med Chem40:3712-4 (1997) 
 
Neuropeptide Y receptor type 1
Name:Neuropeptide Y receptor type 1
Type:Enzyme Catalytic Domain
Mol. Mass.:44399.07
Organism:Homo sapiens (Human)
Description:NPY-Y1 NPY1R HUMAN::P25929
Residue:384
BDBM50060721
NameBDBM50060721
Synonyms:2-(4-Chloro-phenoxymethyl)-1-methyl-3-(2-piperidin-1-yl-ethyl)-1H-indole | CHEMBL121799
TypeSmall organic molecule
Emp. Form.C23H27ClN2O
Mol. Mass.382.926
SMILESCn1c(COc2ccc(Cl)cc2)c(CCN2CCCCC2)c2ccccc12