Reaction Details
TargetNeuropeptide Y receptor type 1
LigandBDBM50060724
Substrate/Competitorn/a
Meas. Tech.ChEMBL_143827 (CHEMBL748712)
Ki 1.9±n/a nM
Citation Hipskind, PALobb, KLNixon, JABritton, TCBruns, RFCatlow, JDieckman-McGinty, DKGackenheimer, SLGitter, BDIyengar, SSchober, DASimmons, RMSwanson, SZarrinmayeh, HZimmerman, DMGehlert, DR Potent and selective 1,2,3-trisubstituted indole NPY Y-1 antagonists. J Med Chem40:3712-4 (1997) 
 
Neuropeptide Y receptor type 1
Name:Neuropeptide Y receptor type 1
Type:Enzyme Catalytic Domain
Mol. Mass.:44399.07
Organism:Homo sapiens (Human)
Description:NPY-Y1 NPY1R HUMAN::P25929
Residue:384
BDBM50060724
NameBDBM50060724
Synonyms:2-[1,4']Bipiperidinyl-1'-yl-1-[2-(4-chloro-phenoxymethyl)-1-(2-piperidin-4-yl-ethyl)-1H-indol-3-yl]-ethanone | CHEMBL340369
TypeSmall organic molecule
Emp. Form.C34H45ClN4O2
Mol. Mass.577.2
SMILESClc1ccc(OCc2c(C(=O)CN3CCC(CC3)N3CCCCC3)c3ccccc3n2CCC2CCNCC2)cc1