Reaction Details
TargetSerine protease 1
LigandBDBM50060759
Substrate/Competitorn/a
Meas. Tech.ChEMBL_212515 (CHEMBL817580)
Ki 1300±n/a nM
Citation Feng, DMGardell, SJLewis, SDBock, MGChen, ZFreidinger, RMNaylor-Olsen, AMRamjit, HGWoltmann, RBaskin, EPLynch, JJLucas, RShafer, JADancheck, KBChen, IWMao, SSKrueger, JAHare, TRMulichak, AMVacca, JP Discovery of a novel, selective, and orally bioavailable class of thrombin inhibitors incorporating aminopyridyl moieties at the P1 position. J Med Chem40:3726-33 (1997) 
 
Serine protease 1
Name:Serine protease 1
Type:Enzyme
Mol. Mass.:25790.52
Organism:Bos taurus (bovine)
Description:P00760
Residue:246
BDBM50060759
NameBDBM50060759
Synonyms:((R)-2-{(S)-2-[(6-Amino-pyridin-3-ylmethyl)-carbamoyl]-pyrrolidin-1-yl}-1-benzhydryl-2-oxo-ethyl)-carbamic acid tert-butyl ester | CHEMBL122488
TypeSmall organic molecule
Emp. Form.C31H37N5O4
Mol. Mass.543.6566
SMILESCC(C)(C)OC(=O)N[C@H](C(c1ccccc1)c1ccccc1)C(=O)N1CCC[C@H]1C(=O)NCc1ccc(N)nc1