Reaction Details
TargetCoagulation factor X
LigandBDBM50060746
Substrate/Competitorn/a
Meas. Tech.ChEMBL_48806 (CHEMBL662831)
Ki 16000±n/a nM
Citation Feng, DMGardell, SJLewis, SDBock, MGChen, ZFreidinger, RMNaylor-Olsen, AMRamjit, HGWoltmann, RBaskin, EPLynch, JJLucas, RShafer, JADancheck, KBChen, IWMao, SSKrueger, JAHare, TRMulichak, AMVacca, JP Discovery of a novel, selective, and orally bioavailable class of thrombin inhibitors incorporating aminopyridyl moieties at the P1 position. J Med Chem40:3726-33 (1997) 
 
Coagulation factor X
Name:Coagulation factor X
Type:Enzyme
Mol. Mass.:54726.60
Organism:Homo sapiens (Human)
Description:n/a
Residue:488
BDBM50060746
NameBDBM50060746
Synonyms:((R)-2-{(S)-2-[(6-Amino-2,4-dimethyl-pyridin-3-ylmethyl)-carbamoyl]-pyrrolidin-1-yl}-1-dicyclohexylmethyl-2-oxo-ethyl)-carbamic acid tert-butyl ester | CHEMBL123142
TypeSmall organic molecule
Emp. Form.C33H53N5O4
Mol. Mass.583.805
SMILESCc1cc(N)nc(C)c1CNC(=O)[C@@H]1CCCN1C(=O)[C@H](NC(=O)OC(C)(C)C)C(C1CCCCC1)C1CCCCC1