Reaction Details
TargetProthrombin
LigandBDBM50060757
Substrate/Competitorn/a
Meas. Tech.ChEMBL_208362 (CHEMBL813672)
Ki 380±n/a nM
Citation Feng, DMGardell, SJLewis, SDBock, MGChen, ZFreidinger, RMNaylor-Olsen, AMRamjit, HGWoltmann, RBaskin, EPLynch, JJLucas, RShafer, JADancheck, KBChen, IWMao, SSKrueger, JAHare, TRMulichak, AMVacca, JP Discovery of a novel, selective, and orally bioavailable class of thrombin inhibitors incorporating aminopyridyl moieties at the P1 position. J Med Chem40:3726-33 (1997) 
 
Prothrombin
Name:Prothrombin
Type:Protein
Mol. Mass.:70029.57
Organism:Homo sapiens (Human)
Description:P00734
Residue:622
BDBM50060757
NameBDBM50060757
Synonyms:(S)-1-[(R)-3-(3,4-Dichloro-phenyl)-2-phenylmethanesulfonylamino-propionyl]-pyrrolidine-2-carboxylic acid (pyridin-3-ylmethyl)-amide | CHEMBL124408
TypeSmall organic molecule
Emp. Form.C27H28Cl2N4O4S
Mol. Mass.575.507
SMILESClc1ccc(C[C@@H](NS(=O)(=O)Cc2ccccc2)C(=O)N2CCC[C@H]2C(=O)NCc2cccnc2)cc1Cl