Reaction Details
TargetProthrombin
LigandBDBM50060760
Substrate/Competitorn/a
Meas. Tech.ChEMBL_208362 (CHEMBL813672)
Ki 0.82±n/a nM
Citation Feng, DMGardell, SJLewis, SDBock, MGChen, ZFreidinger, RMNaylor-Olsen, AMRamjit, HGWoltmann, RBaskin, EPLynch, JJLucas, RShafer, JADancheck, KBChen, IWMao, SSKrueger, JAHare, TRMulichak, AMVacca, JP Discovery of a novel, selective, and orally bioavailable class of thrombin inhibitors incorporating aminopyridyl moieties at the P1 position. J Med Chem40:3726-33 (1997) 
 
Prothrombin
Name:Prothrombin
Type:Protein
Mol. Mass.:70029.57
Organism:Homo sapiens (Human)
Description:P00734
Residue:622
BDBM50060760
NameBDBM50060760
Synonyms:(S)-1-((R)-2-Amino-3,3-dicyclohexyl-propionyl)-pyrrolidine-2-carboxylic acid (6-amino-pyridin-3-ylmethyl)-amide | CHEMBL421437
TypeSmall organic molecule
Emp. Form.C26H41N5O2
Mol. Mass.455.636
SMILESN[C@H](C(C1CCCCC1)C1CCCCC1)C(=O)N1CCC[C@H]1C(=O)NCc1ccc(N)nc1