Reaction Details
TargetSerine protease 1
LigandBDBM50060742
Substrate/Competitorn/a
Meas. Tech.ChEMBL_212512 (CHEMBL817577)
Ki 5200±n/a nM
Citation Feng, DMGardell, SJLewis, SDBock, MGChen, ZFreidinger, RMNaylor-Olsen, AMRamjit, HGWoltmann, RBaskin, EPLynch, JJLucas, RShafer, JADancheck, KBChen, IWMao, SSKrueger, JAHare, TRMulichak, AMVacca, JP Discovery of a novel, selective, and orally bioavailable class of thrombin inhibitors incorporating aminopyridyl moieties at the P1 position. J Med Chem40:3726-33 (1997) 
 
Serine protease 1
Name:Serine protease 1
Type:Enzyme
Mol. Mass.:25790.52
Organism:Bos taurus (bovine)
Description:P00760
Residue:246
BDBM50060742
NameBDBM50060742
Synonyms:((R)-2-{(S)-2-[(2-Amino-thiazol-4-ylmethyl)-carbamoyl]-pyrrolidin-1-yl}-1-dicyclohexylmethyl-2-oxo-ethyl)-carbamic acid tert-butyl ester | CHEMBL420334
TypeSmall organic molecule
Emp. Form.C29H47N5O4S
Mol. Mass.561.78
SMILESCC(C)(C)OC(=O)N[C@H](C(C1CCCCC1)C1CCCCC1)C(=O)N1CCC[C@H]1C(=O)NCc1csc(N)n1