Reaction Details
TargetGonadotropin-releasing hormone receptor
LigandBDBM50060785
Substrate/Competitorn/a
Meas. Tech.ChEMBL_71736 (CHEMBL680259)
IC50 0.056±n/a nM
Citation Jiang, GMiller, CKoerber, SCPorter, JCraig, AGBhattacharjee, SKraft, PBurris, TPCampen, CARivier, CLRivier, JE Betidamino acid scan of the GnRH antagonist acyline. J Med Chem40:3739-48 (1997) 
 
Gonadotropin-releasing hormone receptor
Name:Gonadotropin-releasing hormone receptor
Type:PROTEIN
Mol. Mass.:37767.60
Organism:Rattus norvegicus
Description:ChEMBL_1335047
Residue:327
BDBM50060785
NameBDBM50060785
Synonyms:CHEMBL268095 | [D or LAgl (hydroxyacetic acid)4]acyline
TypeSmall organic molecule
Emp. Form.C81H103ClN16O15
Mol. Mass.1576.236
SMILESCC(C)C[C@H](NC(=O)[C@@H](Cc1ccc(NC(C)=O)cc1)NC(=O)[C@H](Cc1ccc(NC(C)=O)cc1)NC(=O)[C@@H](NC(=O)CO)NC(=O)[C@@H](Cc1cccnc1)NC(=O)[C@@H](Cc1ccc(Cl)cc1)NC(=O)[C@@H](Cc1ccc2ccccc2c1)NC(C)=O)C(=O)N[C@@H](CCCCNC(C)C)C(=O)N1CCC[C@@H]1C(=O)N[C@H](C)C(N)=O