Reaction Details
TargetGonadotropin-releasing hormone receptor
LigandBDBM50060797
Substrate/Competitorn/a
Meas. Tech.ChEMBL_71736 (CHEMBL680259)
IC50 1.9±n/a nM
Citation Jiang, GMiller, CKoerber, SCPorter, JCraig, AGBhattacharjee, SKraft, PBurris, TPCampen, CARivier, CLRivier, JE Betidamino acid scan of the GnRH antagonist acyline. J Med Chem40:3739-48 (1997) 
 
Gonadotropin-releasing hormone receptor
Name:Gonadotropin-releasing hormone receptor
Type:PROTEIN
Mol. Mass.:37767.60
Organism:Rattus norvegicus
Description:ChEMBL_1335047
Residue:327
BDBM50060797
NameBDBM50060797
Synonyms:CHEMBL410818 | [L or DAgl (Me, 4-(acetylamino)benzoyl)6]acyline
TypeSmall organic molecule
Emp. Form.C81H103ClN16O15
Mol. Mass.1576.236
SMILESCC(C)C[C@H](NC(=O)[C@H](NC(=O)[C@H](Cc1ccc(NC(C)=O)cc1)NC(=O)[C@H](CO)NC(=O)[C@@H](Cc1cccnc1)NC(=O)[C@@H](Cc1ccc(Cl)cc1)NC(=O)[C@@H](Cc1ccc2ccccc2c1)NC(C)=O)N(C)C(=O)c1ccc(NC(C)=O)cc1)C(=O)N[C@@H](CCCCNC(C)C)C(=O)N1CCC[C@@H]1C(=O)N[C@H](C)C(N)=O