Reaction Details
TargetAlpha-1D adrenergic receptor
LigandBDBM50060964
Substrate/Competitorn/a
Meas. Tech.ChEMBL_32432 (CHEMBL873049)
Ki 0.058±n/a nM
Citation Meyer, MDAltenbach, RJBasha, FZCarroll, WADrizin, IElmore, SWEhrlich, PPLebold, SATietje, KSippy, KBWendt, MDPlata, DJPlagge, FBuckner, SABrune, MEHancock, AAKerwin, JF Synthesis and pharmacological characterization of 3-[2-((3aR,9bR)-cis-6-methoxy-2,3,3a,4,5,9b-hexahydro-1H-benz[e] isoindol-2-yl)ethyl]pyrido-[3',4':4,5]thieno[3,2-d]pyrimidine-2,4 (1H,3H)-dione (A-131701): a uroselective alpha 1A adrenoceptor antagonist for the symptomatic treatment of benign pr J Med Chem40:3141-3 (1997) 
 
Alpha-1D adrenergic receptor
Name:Alpha-1D adrenergic receptor
Type:Enzyme Catalytic Domain
Mol. Mass.:60485.82
Organism:Homo sapiens (Human)
Description:adrenergic Alpha1D ADRA1D HUMAN::P25100
Residue:572
BDBM50060964
NameBDBM50060964
Synonyms:(R)-5-(2-((2-(2-ethoxyphenoxy)ethyl)amino)propyl)-2-methoxybenzenesulfonamide 5-[2-[2-(2-ethoxyphenoxy)ethylamino]propyl]-2-methoxy-benzenesulfonamide TAMSULOSIN
TypeSmall organic molecule
Emp. Form.C20H28N2O5S
Mol. Mass.408.512
SMILESCCOc1ccccc1OCCN[C@H](C)Cc1ccc(OC)c(c1)S(N)(=O)=O