Reaction Details
TargetEndothelin-1 receptor
LigandBDBM50061096
Substrate/Competitorn/a
Meas. Tech.ChEMBL_63500 (CHEMBL676491)
IC50 0.100000±n/a nM
Citation Jae, HSWinn, MDixon, DBMarsh, KCNguyen, BOpgenorth, TJvon Geldern, TW Pyrrolidine-3-carboxylic acids as endothelin antagonists. 2. Sulfonamide-based ETA/ETB mixed antagonists. J Med Chem40:3217-27 (1997) 
 
Endothelin-1 receptor
Name:Endothelin-1 receptor
Type:Enzyme Catalytic Domain
Mol. Mass.:48256.91
Organism:RAT
Description:ENDOTHELIN A EDNRA RAT::P26684
Residue:426
BDBM50061096
NameBDBM50061096
Synonyms:(2R,3R,4S)-4-Benzo[1,3]dioxol-5-yl-1-{2-[(butane-1-sulfonyl)-propyl-amino]-ethyl}-2-(3-fluoro-4-methoxy-phenyl)-pyrrolidine-3-carboxylic acid | CHEMBL323464
TypeSmall organic molecule
Emp. Form.C28H37FN2O7S
Mol. Mass.564.666
SMILESCCCCS(=O)(=O)N(CCC)CCN1C[C@@H]([C@H]([C@@H]1c1ccc(OC)c(F)c1)C(O)=O)c1ccc2OCOc2c1