Reaction Details
TargetEndothelin-1 receptor
LigandBDBM50061078
Substrate/Competitorn/a
Meas. Tech.ChEMBL_63500 (CHEMBL676491)
IC50 0.550±n/a nM
Citation Jae, HSWinn, MDixon, DBMarsh, KCNguyen, BOpgenorth, TJvon Geldern, TW Pyrrolidine-3-carboxylic acids as endothelin antagonists. 2. Sulfonamide-based ETA/ETB mixed antagonists. J Med Chem40:3217-27 (1997) 
 
Endothelin-1 receptor
Name:Endothelin-1 receptor
Type:Enzyme Catalytic Domain
Mol. Mass.:48256.91
Organism:RAT
Description:ENDOTHELIN A EDNRA RAT::P26684
Residue:426
BDBM50061078
NameBDBM50061078
Synonyms:(2R,3R,4S)-4-Benzo[1,3]dioxol-5-yl-2-(3-fluoro-4-methoxy-phenyl)-1-{2-[propyl-(4,4,4-trifluoro-butane-1-sulfonyl)-amino]-ethyl}-pyrrolidine-3-carboxylic acid | CHEMBL419367
TypeSmall organic molecule
Emp. Form.C28H34F4N2O7S
Mol. Mass.618.637
SMILESCCCN(CCN1C[C@@H]([C@H]([C@@H]1c1ccc(OC)c(F)c1)C(O)=O)c1ccc2OCOc2c1)S(=O)(=O)CCCC(F)(F)F