Reaction Details
TargetEndothelin-1 receptor
LigandBDBM50061074
Substrate/Competitorn/a
Meas. Tech.ChEMBL_63500 (CHEMBL676491)
IC50 0.520±n/a nM
Citation Jae, HSWinn, MDixon, DBMarsh, KCNguyen, BOpgenorth, TJvon Geldern, TW Pyrrolidine-3-carboxylic acids as endothelin antagonists. 2. Sulfonamide-based ETA/ETB mixed antagonists. J Med Chem40:3217-27 (1997) 
 
Endothelin-1 receptor
Name:Endothelin-1 receptor
Type:Enzyme Catalytic Domain
Mol. Mass.:48256.91
Organism:RAT
Description:ENDOTHELIN A EDNRA RAT::P26684
Residue:426
BDBM50061074
NameBDBM50061074
Synonyms:(2R,3R,4S)-4-Benzo[1,3]dioxol-5-yl-2-(3-fluoro-4-methoxy-phenyl)-1-{2-[(pentane-1-sulfonyl)-propyl-amino]-ethyl}-pyrrolidine-3-carboxylic acid CHEMBL111277
TypeSmall organic molecule
Emp. Form.C29H39FN2O7S
Mol. Mass.578.693
SMILESCCCCCS(=O)(=O)N(CCC)CCN1C[C@@H]([C@H]([C@@H]1c1ccc(OC)c(F)c1)C(O)=O)c1ccc2OCOc2c1