Reaction Details
TargetEndothelin-1 receptor
LigandBDBM50050964
Substrate/Competitorn/a
Meas. Tech.ChEMBL_65460 (CHEMBL682100)
IC50 0.26±n/a nM
Citation Jae, HSWinn, MDixon, DBMarsh, KCNguyen, BOpgenorth, TJvon Geldern, TW Pyrrolidine-3-carboxylic acids as endothelin antagonists. 2. Sulfonamide-based ETA/ETB mixed antagonists. J Med Chem40:3217-27 (1997) 
 
Endothelin-1 receptor
Name:Endothelin-1 receptor
Type:Enzyme Catalytic Domain
Mol. Mass.:48736.88
Organism:Homo sapiens (Human)
Description:P25101
Residue:427
BDBM50050964
NameBDBM50050964
Synonyms:4-[1-Benzo[1,3]dioxol-5-yl-2-(4-isopropyl-benzenesulfonylamino)-2-oxo-ethoxy]-3-propyl-benzoic acid L-754142
TypeSmall organic molecule
Emp. Form.C28H29NO8S
Mol. Mass.539.597
SMILESCCCc1cc(ccc1OC(C(=O)NS(=O)(=O)c1ccc(cc1)C(C)C)c1ccc2OCOc2c1)C(O)=O