Reaction Details
TargetEndothelin-1 receptor
LigandBDBM50061085
Substrate/Competitorn/a
Meas. Tech.ChEMBL_65471 (CHEMBL873596)
IC50 0.077±n/a nM
Citation Jae, HSWinn, MDixon, DBMarsh, KCNguyen, BOpgenorth, TJvon Geldern, TW Pyrrolidine-3-carboxylic acids as endothelin antagonists. 2. Sulfonamide-based ETA/ETB mixed antagonists. J Med Chem40:3217-27 (1997) 
 
Endothelin-1 receptor
Name:Endothelin-1 receptor
Type:Enzyme Catalytic Domain
Mol. Mass.:48736.88
Organism:Homo sapiens (Human)
Description:P25101
Residue:427
BDBM50061085
NameBDBM50061085
Synonyms:(2R,3R,4S)-4-Benzo[1,3]dioxol-5-yl-2-(3-fluoro-4-methoxy-phenyl)-1-{2-[(hexane-1-sulfonyl)-propyl-amino]-ethyl}-pyrrolidine-3-carboxylic acid | CHEMBL109644
TypeSmall organic molecule
Emp. Form.C30H41FN2O7S
Mol. Mass.592.719
SMILESCCCCCCS(=O)(=O)N(CCC)CCN1C[C@@H]([C@H]([C@@H]1c1ccc(OC)c(F)c1)C(O)=O)c1ccc2OCOc2c1