Reaction Details
TargetCannabinoid receptor 1
LigandBDBM60994
Substrate/Competitorn/a
Meas. Tech.ChEMBL_46805 (CHEMBL659692)
Ki 80±n/a nM
Citation Rhee, MHVogel, ZBarg, JBayewitch, MLevy, RHanus, LBreuer, AMechoulam, R Cannabinol derivatives: binding to cannabinoid receptors and inhibition of adenylylcyclase. J Med Chem40:3228-33 (1997) 
 
Cannabinoid receptor 1
Name:Cannabinoid receptor 1
Type:G Protein-Coupled Receptor (GPCR)
Mol. Mass.:52856.55
Organism:Rattus norvegicus (rat)
Description:P20272
Residue:473
BDBM60994
NameBDBM60994
Synonyms:(10R,10aR)-6,6,9-Trimethyl-3-pentyl-6a,7,8,10a-tetrahydro-6H-benzo[c]chromen-1-ol 1N-[2-(5-dimethylaminomethyl-2-furylmethylsulfanyl)ethyl]-1N-methyl-2-nitro-(Z)-1-ethene-1,1-diamine 6,6,9-Trimethyl-3-pentyl-6a,7,8,10a-tetrahydro-6H-benzo[c]chromen-1-ol(DeltaE-9-THC) 8,8-Dimethyl-11-methylene-5-pentyl-3,4,8a,9,10,11,12,12a-octahydro-2H,8H-1,7-dioxa-benzo[c]phenanthrene BDBM50007391 DRONABINOL Tetrahydrocannabinol delta-9-THC delta-9-Tetrahydrocannabinol (THC) delta9-tetrahydrocannabinol
Typen/a
Emp. Form.C21H30O2
Mol. Mass.314.4617
SMILESCCCCCc1cc(O)c2[C@@H]3C=C(C)CC[C@H]3C(C)(C)Oc2c1