Reaction Details
TargetCannabinoid receptor 1
LigandBDBM50061113
Substrate/Competitorn/a
Meas. Tech.ChEMBL_46635 (CHEMBL658891)
Ki 3.3±n/a nM
Citation Rhee, MHVogel, ZBarg, JBayewitch, MLevy, RHanus, LBreuer, AMechoulam, R Cannabinol derivatives: binding to cannabinoid receptors and inhibition of adenylylcyclase. J Med Chem40:3228-33 (1997) 
 
Cannabinoid receptor 1
Name:Cannabinoid receptor 1
Type:G Protein-Coupled Receptor (GPCR)
Mol. Mass.:52856.55
Organism:Rattus norvegicus (rat)
Description:P20272
Residue:473
BDBM50061113
NameBDBM50061113
Synonyms:3-(1',1'-dimethylheptyl)-6,6,9-trimethyl-6H-benzo[c]chromene-1-ol CHEMBL109393
TypeSmall organic molecule
Emp. Form.C25H34O2
Mol. Mass.366.5363
SMILESCCCCCCC(C)(C)c1cc(O)c-2c(OC(C)(C)c3ccc(C)cc-23)c1