Reaction Details
TargetCannabinoid receptor 1
LigandBDBM50000727
Substrate/Competitorn/a
Meas. Tech.ChEMBL_46805 (CHEMBL659692)
Ki 0.1±n/a nM
Citation Rhee, MHVogel, ZBarg, JBayewitch, MLevy, RHanus, LBreuer, AMechoulam, R Cannabinol derivatives: binding to cannabinoid receptors and inhibition of adenylylcyclase. J Med Chem40:3228-33 (1997) 
 
Cannabinoid receptor 1
Name:Cannabinoid receptor 1
Type:G Protein-Coupled Receptor (GPCR)
Mol. Mass.:52856.55
Organism:Rattus norvegicus (rat)
Description:P20272
Residue:473
BDBM50000727
NameBDBM50000727
Synonyms:(R)-3-(1,1-Dimethyl-heptyl)-9-hydroxymethyl-6,6-dimethyl-6a,7,10,10a-tetrahydro-6H-benzo[c]chromen-1-ol CHEMBL432107 | HU-210
TypeSmall organic molecule
Emp. Form.C25H38O3
Mol. Mass.386.5674
SMILESCCCCCCC(C)(C)c1cc(O)c2C3CC(CO)=CC[C@H]3C(C)(C)Oc2c1