Reaction Details
Target5-hydroxytryptamine receptor 1B
LigandBDBM50454687
Substrate/Competitorn/a
Meas. Tech.ChEMBL_1358 (CHEMBL616431)
Ki 0.430000±n/a nM
Citation Jorand-Lebrun, CPauwels, PJPalmier, CMoret, CChopin, PPerez, MMarien, MHalazy, S 5-HT1B receptor antagonist properties of novel arylpiperazide derivatives of 1-naphthylpiperazine. J Med Chem40:3974-8 (1998) 
 
5-hydroxytryptamine receptor 1B
Name:5-hydroxytryptamine receptor 1B
Type:G Protein-Coupled Receptor (GPCR)
Mol. Mass.:43579.17
Organism:Homo sapiens (Human)
Description:Receptor binding assays were performed using human clone stably expressed in CHO cells
Residue:390
BDBM50454687
NameBDBM50454687
Synonyms:CHEMBL2112661
TypeSmall organic molecule
Emp. Form.C31H34N4O2
Mol. Mass.494.6273
SMILESCN1CCN(CC1)c1cccc2ccc(OCC(=O)N3CCN(CC3)c3cccc4ccccc34)cc12