Reaction Details
Target5-hydroxytryptamine receptor 1B
LigandBDBM50061303
Substrate/Competitorn/a
Meas. Tech.ChEMBL_1595 (CHEMBL617005)
EC50>1000±n/a nM
Citation Jorand-Lebrun, CPauwels, PJPalmier, CMoret, CChopin, PPerez, MMarien, MHalazy, S 5-HT1B receptor antagonist properties of novel arylpiperazide derivatives of 1-naphthylpiperazine. J Med Chem40:3974-8 (1998) 
 
5-hydroxytryptamine receptor 1B
Name:5-hydroxytryptamine receptor 1B
Type:G Protein-Coupled Receptor (GPCR)
Mol. Mass.:43579.17
Organism:Homo sapiens (Human)
Description:Receptor binding assays were performed using human clone stably expressed in CHO cells
Residue:390
BDBM50061303
NameBDBM50061303
Synonyms:2'-Methyl-4'-(5-methyl-4,5-dihydro-[1,2,4]oxadiazol-3-yl)-biphenyl-4-carboxylic acid [4-methoxy-3-(4-methyl-piperazin-1-yl)-phenyl]-amide | CHEMBL339308
TypeSmall organic molecule
Emp. Form.C29H33N5O3
Mol. Mass.499.604
SMILESCOc1ccc(NC(=O)c2ccc(cc2)-c2ccc(cc2C)C2=NOC(C)N2)cc1N1CCN(C)CC1