Reaction Details
TargetD(4) dopamine receptor
LigandBDBM50061326
Substrate/Competitorn/a
Meas. Tech.ChEMBL_60661 (CHEMBL671698)
Ki 5.6±n/a nM
Citation Unangst, PCCapiris, TConnor, DTDoubleday, RHeffner, TGMacKenzie, RGMiller, SRPugsley, TAWise, LD (Aryloxy)alkylamines as selective human dopamine D4 receptor antagonists: potential antipsychotic agents. J Med Chem40:4026-9 (1998) 
 
D(4) dopamine receptor
Name:D(4) dopamine receptor
Type:Enzyme
Mol. Mass.:48373.19
Organism:Homo sapiens (Human)
Description:P21917
Residue:419
BDBM50061326
NameBDBM50061326
Synonyms:CHEMBL131484 | [2-(4-Chloro-phenoxy)-ethyl]-(3-p-tolyloxy-propyl)-amine
TypeSmall organic molecule
Emp. Form.C18H22ClNO2
Mol. Mass.319.826
SMILESCc1ccc(OCCCNCCOc2ccc(Cl)cc2)cc1