Reaction Details
TargetD(2) dopamine receptor
LigandBDBM50061349
Substrate/Competitorn/a
Meas. Tech.ChEMBL_60064 (CHEMBL671378)
Ki 22±n/a nM
Citation Unangst, PCCapiris, TConnor, DTDoubleday, RHeffner, TGMacKenzie, RGMiller, SRPugsley, TAWise, LD (Aryloxy)alkylamines as selective human dopamine D4 receptor antagonists: potential antipsychotic agents. J Med Chem40:4026-9 (1998) 
 
D(2) dopamine receptor
Name:D(2) dopamine receptor
Type:Cell-surface receptors
Mol. Mass.:50647.10
Organism:Homo sapiens (Human)
Description:P14416
Residue:443
BDBM50061349
NameBDBM50061349
Synonyms:CHEMBL129534 | [2-(3-Chloro-phenoxy)-ethyl]-(3-phenoxy-propyl)-amine
TypeSmall organic molecule
Emp. Form.C17H20ClNO2
Mol. Mass.305.799
SMILESClc1cccc(OCCNCCCOc2ccccc2)c1