Reaction Details
TargetD(4) dopamine receptor
LigandBDBM50061340
Substrate/Competitorn/a
Meas. Tech.ChEMBL_60661 (CHEMBL671698)
Ki 4.4±n/a nM
Citation Unangst, PCCapiris, TConnor, DTDoubleday, RHeffner, TGMacKenzie, RGMiller, SRPugsley, TAWise, LD (Aryloxy)alkylamines as selective human dopamine D4 receptor antagonists: potential antipsychotic agents. J Med Chem40:4026-9 (1998) 
 
D(4) dopamine receptor
Name:D(4) dopamine receptor
Type:Enzyme
Mol. Mass.:48373.19
Organism:Homo sapiens (Human)
Description:P21917
Residue:419
BDBM50061340
NameBDBM50061340
Synonyms:CHEMBL131396 | [2-(2-Chloro-phenoxy)-ethyl]-(3-phenoxy-propyl)-amine
TypeSmall organic molecule
Emp. Form.C17H20ClNO2
Mol. Mass.305.799
SMILESClc1ccccc1OCCNCCCOc1ccccc1