Reaction Details
TargetD(4) dopamine receptor
LigandBDBM50061345
Substrate/Competitorn/a
Meas. Tech.ChEMBL_60661 (CHEMBL671698)
Ki 0.35±n/a nM
Citation Unangst, PCCapiris, TConnor, DTDoubleday, RHeffner, TGMacKenzie, RGMiller, SRPugsley, TAWise, LD (Aryloxy)alkylamines as selective human dopamine D4 receptor antagonists: potential antipsychotic agents. J Med Chem40:4026-9 (1998) 
 
D(4) dopamine receptor
Name:D(4) dopamine receptor
Type:Enzyme
Mol. Mass.:48373.19
Organism:Homo sapiens (Human)
Description:P21917
Residue:419
BDBM50061345
NameBDBM50061345
Synonyms:CHEMBL129927 | [2-(3,4-Dimethyl-phenoxy)-ethyl]-(3-phenoxy-propyl)-amine
TypeSmall organic molecule
Emp. Form.C19H25NO2
Mol. Mass.299.4073
SMILESCc1ccc(OCCNCCCOc2ccccc2)cc1C