Reaction Details
TargetGag-Pol polyprotein [489-587]
LigandBDBM50061409
Substrate/Competitorn/a
Meas. Tech.ChEMBL_159973 (CHEMBL768120)
Ki 0.012±n/a nM
Citation Wilkerson, WWDax, SCheatham, WW Nonsymmetrically substituted cyclic urea HIV protease inhibitors. J Med Chem40:4079-88 (1998) 
 
Gag-Pol polyprotein [489-587]
Name:Gag-Pol polyprotein [489-587]
Type:Enzyme Subunit
Mol. Mass.:10781.16
Organism:Human immunodeficiency virus type 1
Description:P04585[489-587]
Residue:99
BDBM50061409
NameBDBM50061409
Synonyms:3-[(4R,5S,6S,7R)-3-(3-Amino-benzyl)-4,7-dibenzyl-5,6-dihydroxy-2-oxo-[1,3]diazepan-1-ylmethyl]-N-(1H-imidazol-2-yl)-benzamide | CHEMBL133292
TypeSmall organic molecule
Emp. Form.C37H38N6O4
Mol. Mass.630.7354
SMILESNc1cccc(CN2[C@H](Cc3ccccc3)[C@H](O)[C@@H](O)[C@@H](Cc3ccccc3)N(Cc3cccc(c3)C(=O)Nc3ncc[nH]3)C2=O)c1