Reaction Details
TargetGag-Pol polyprotein [489-587]
LigandBDBM50054156
Substrate/Competitorn/a
Meas. Tech.ChEMBL_159973 (CHEMBL768120)
Ki 0.011±n/a nM
Citation Wilkerson, WWDax, SCheatham, WW Nonsymmetrically substituted cyclic urea HIV protease inhibitors. J Med Chem40:4079-88 (1998) 
 
Gag-Pol polyprotein [489-587]
Name:Gag-Pol polyprotein [489-587]
Type:Enzyme Subunit
Mol. Mass.:10781.16
Organism:Human immunodeficiency virus type 1
Description:P04585[489-587]
Residue:99
BDBM50054156
NameBDBM50054156
Synonyms:(4r,5r,6,7)-3,3-[[Tetrahydro-5,6-dihydroxy-2-oxo-4,7-bis(phenylmethyl)-1H-1,3-diazepine-1,3(2H)-diyl]bis-methylene)]bis[N-(5-methyl-2-pyridinyl)benzamide] CHEMBL85653
TypeSmall organic molecule
Emp. Form.C47H46N6O5
Mol. Mass.774.9053
SMILESCc1ccc(NC(=O)c2cccc(CN3[C@H](Cc4ccccc4)[C@H](O)[C@@H](O)[C@@H](Cc4ccccc4)N(Cc4cccc(c4)C(=O)Nc4ccc(C)cn4)C3=O)c2)nc1