Reaction Details
TargetRetinoic acid receptor alpha
LigandBDBM50061616
Substrate/Competitorn/a
Meas. Tech.ChEMBL_197409 (CHEMBL799798)
Ki 1400±n/a nM
Citation Umemiya, HFukasawa, HEbisawa, MEyrolles, LKawachi, EEisenmann, GGronemeyer, HHashimoto, YShudo, KKagechika, H Regulation of retinoidal actions by diazepinylbenzoic acids. Retinoid synergists which activate the RXR-RAR heterodimers. J Med Chem40:4222-34 (1998) 
 
Retinoic acid receptor alpha
Name:Retinoic acid receptor alpha
Type:PROTEIN
Mol. Mass.:50778.87
Organism:Homo sapiens (Human)
Description:ChEMBL_1466191
Residue:462
BDBM50061616
NameBDBM50061616
Synonyms:4-(5,7,7,10,10-Pentamethyl-7,8,9,10-tetrahydro-5H-5,12-diaza-benzo[4,5]cyclohepta[1,2-b]naphthalen-13-yl)-benzoic acid | CHEMBL37708
TypeSmall organic molecule
Emp. Form.C29H30N2O2
Mol. Mass.438.5607
SMILESCN1c2cc3c(cc2N=C(c2ccc(cc2)C(O)=O)c2ccccc12)C(C)(C)CCC3(C)C