Reaction Details
TargetRetinoic acid receptor beta
LigandBDBM50061617
Substrate/Competitorn/a
Meas. Tech.ChEMBL_195499 (CHEMBL798920)
Ki 320±n/a nM
Citation Umemiya, HFukasawa, HEbisawa, MEyrolles, LKawachi, EEisenmann, GGronemeyer, HHashimoto, YShudo, KKagechika, H Regulation of retinoidal actions by diazepinylbenzoic acids. Retinoid synergists which activate the RXR-RAR heterodimers. J Med Chem40:4222-34 (1998) 
 
Retinoic acid receptor beta
Name:Retinoic acid receptor beta
Type:PROTEIN
Mol. Mass.:50498.70
Organism:Homo sapiens (Human)
Description:ChEMBL_1458015
Residue:455
BDBM50061617
NameBDBM50061617
Synonyms:4-(7,7,10,10-Tetramethyl-7,8,9,10-tetrahydro-5-oxa-13-aza-benzo[4,5]cyclohepta[1,2-b]naphthalen-12-yl)-benzoic acid | CHEMBL334534
TypeSmall organic molecule
Emp. Form.C28H27NO3
Mol. Mass.425.5189
SMILESCC1(C)CCC(C)(C)c2cc3c(Oc4ccccc4N=C3c3ccc(cc3)C(O)=O)cc12