Reaction Details
TargetRetinoic acid receptor gamma
LigandBDBM50061615
Substrate/Competitorn/a
Meas. Tech.ChEMBL_196007 (CHEMBL797871)
Ki 490±n/a nM
Citation Umemiya, HFukasawa, HEbisawa, MEyrolles, LKawachi, EEisenmann, GGronemeyer, HHashimoto, YShudo, KKagechika, H Regulation of retinoidal actions by diazepinylbenzoic acids. Retinoid synergists which activate the RXR-RAR heterodimers. J Med Chem40:4222-34 (1998) 
 
Retinoic acid receptor gamma
Name:Retinoic acid receptor gamma
Type:PROTEIN
Mol. Mass.:50345.43
Organism:Homo sapiens (Human)
Description:ChEMBL_1458016
Residue:454
BDBM50061615
NameBDBM50061615
Synonyms:4-(10,10,13,13,15-Pentamethyl-11,12,13,15-tetrahydro-10H-8,15-diaza-cyclohepta[2,1-a;4,5-b']dinaphthalen-7-yl)-benzoic acid | CHEMBL298373
TypeSmall organic molecule
Emp. Form.C33H32N2O2
Mol. Mass.488.6194
SMILESCN1c2cc3c(cc2N=C(c2ccc(cc2)C(O)=O)c2ccc4ccccc4c12)C(C)(C)CCC3(C)C