Reaction Details
TargetRetinoic acid receptor beta
LigandBDBM31883
Substrate/Competitorn/a
Meas. Tech.ChEMBL_195492 (CHEMBL798914)
Ki 4.1±n/a nM
Citation Umemiya, HFukasawa, HEbisawa, MEyrolles, LKawachi, EEisenmann, GGronemeyer, HHashimoto, YShudo, KKagechika, H Regulation of retinoidal actions by diazepinylbenzoic acids. Retinoid synergists which activate the RXR-RAR heterodimers. J Med Chem40:4222-34 (1998) 
 
Retinoic acid receptor beta
Name:Retinoic acid receptor beta
Type:PROTEIN
Mol. Mass.:50498.70
Organism:Homo sapiens (Human)
Description:ChEMBL_1458015
Residue:455
BDBM31883
NameBDBM31883
Synonyms:9-cis-retinoic acid (9cRA) AT-RA CHEMBL38 SMR000058245 Vitamin A acid [3H]Retinoic acid [3H]tretinoin cid_444795
Typeradiolabeled ligand
Emp. Form.C20H28O2
Mol. Mass.300.4351
SMILESC\C(\C=C\C1=C(C)CCCC1(C)C)=C/C=C/C(/C)=C/C(O)=O