Reaction Details
TargetRetinoic acid receptor RXR-alpha
LigandBDBM50061624
Substrate/Competitorn/a
Meas. Tech.ChEMBL_196488 (CHEMBL798302)
Ki 1900±n/a nM
Citation Umemiya, HFukasawa, HEbisawa, MEyrolles, LKawachi, EEisenmann, GGronemeyer, HHashimoto, YShudo, KKagechika, H Regulation of retinoidal actions by diazepinylbenzoic acids. Retinoid synergists which activate the RXR-RAR heterodimers. J Med Chem40:4222-34 (1998) 
 
Retinoic acid receptor RXR-alpha
Name:Retinoic acid receptor RXR-alpha
Type:PROTEIN
Mol. Mass.:50820.38
Organism:Homo sapiens (Human)
Description:ChEMBL_1456363
Residue:462
BDBM50061624
NameBDBM50061624
Synonyms:4-(5,7,7,10,10-Pentamethyl-7,8,9,10-tetrahydro-5H-5,13-diaza-benzo[4,5]cyclohepta[1,2-b]naphthalen-12-yl)-benzoic acid | CHEMBL334330
TypeSmall organic molecule
Emp. Form.C29H30N2O2
Mol. Mass.438.5607
SMILESCN1c2ccccc2N=C(c2ccc(cc2)C(O)=O)c2cc3c(cc12)C(C)(C)CCC3(C)C